"anno_di_imposta","codice_catastale","codice_istat_comune","denominazione_comune","sigla_provincia","regione","codice_istat_regione","numero_contribuenti","reddito_da_fabbricati_frequenza","reddito_da_fabbricati_ammontare","reddito_da_lavoro_dipendente_e_assimilati_frequenza","reddito_da_lavoro_dipendente_e_assimilati_ammontare","reddito_da_pensione_frequenza","reddito_da_pensione_ammontare","reddito_da_lavoro_autonomo_comprensivo_dei_valori_nulli_frequenza","reddito_da_lavoro_autonomo_comprensivo_dei_valori_nulli_ammontare","reddito_di_spettanza_dell_imprenditore_in_contabilita_ordinaria_comprensivo_dei_valori_nulli_frequenza","reddito_di_spettanza_dell_imprenditore_in_contabilita_ordinaria_comprensivo_dei_valori_nulli_ammontare","reddito_di_spettanza_dell_imprenditore_in_contabilita_semplificata_comprensivo_dei_valori_nulli_frequenza","reddito_di_spettanza_dell_imprenditore_in_contabilita_semplificata_comprensivo_dei_valori_nulli_ammontare","reddito_da_partecipazione_comprensivo_dei_valori_nulli_frequenza","reddito_da_partecipazione_comprensivo_dei_valori_nulli_ammontare","reddito_imponibile_frequenza","reddito_imponibile_ammontare","imposta_netta_frequenza","imposta_netta_ammontare","reddito_imponibile_addizionale_frequenza","reddito_imponibile_addizionale_ammontare","addizionale_regionale_dovuta_frequenza","addizionale_regionale_dovuta_ammontare","addizionale_comunale_dovuta_frequenza","addizionale_comunale_dovuta_ammontare","reddito_complessivo_minore_o_uguale_a_zero_euro_frequenza","reddito_complessivo_minore_o_uguale_a_zero_euro_ammontare","reddito_complessivo_da_0_a_10000_euro_frequenza","reddito_complessivo_da_0_a_10000_euro_ammontare","reddito_complessivo_da_10000_a_15000_euro_frequenza","reddito_complessivo_da_10000_a_15000_euro_ammontare","reddito_complessivo_da_15000_a_26000_euro_frequenza","reddito_complessivo_da_15000_a_26000_euro_ammontare","reddito_complessivo_da_26000_a_55000_euro_frequenza","reddito_complessivo_da_26000_a_55000_euro_ammontare","reddito_complessivo_da_55000_a_75000_euro_frequenza","reddito_complessivo_da_55000_a_75000_euro_ammontare","reddito_complessivo_da_75000_a_120000_euro_frequenza","reddito_complessivo_da_75000_a_120000_euro_ammontare","reddito_complessivo_oltre_120000_euro_frequenza","reddito_complessivo_oltre_120000_euro_ammontare"
"2015","H951","30102","SAN LEONARDO","UD","Friuli Venezia Giulia","6","885","445","336455","426","8536475","363","5326738","7","96359",,,"30","618836","37","370711","858","15170330","692","2572885","681","14293678","663","165669","667","29449",,,"243","998664","121","1529826","314","6419809","178","5784905","10","644691",,,,
"2015","A103","30001","AIELLO DEL FRIULI","UD","Friuli Venezia Giulia","6","1759","879","703079","779","17514110","793","11867387","28","1091442","11","356702","56","1055830","85","1687487","1722","32863244","1399","6016212","1368","30923744","1336","352767","769","49786",,,"474","2491271","302","3748646","564","11342447","336","11601267","35","2244052","24","2235214","5","1185042"
"2015","A254","30002","AMARO","UD","Friuli Venezia Giulia","6","639","342","189685","369","7573218","230","3663349","8","187111","5","119180","11","276884","22","346381","628","12019489","520","2073428","517","11499425","506","134408","13","1720","6","-62926","162","810547","69","873618","242","5061657","147","4819328","5","304825",,,,
"2015","A267","30003","AMPEZZO","UD","Friuli Venezia Giulia","6","798","325","195897","342","6043674","381","5148355","4","199029","8","134070","29","590984","48","789340","779","12642110","598","2021755","592","11690738","581","132741","582","46863","0","0","260","1260455","124","1541082","274","5431421","122","4161116","4","233577","5","432460",,
"2015","A283","93001","ANDREIS","PN","Friuli Venezia Giulia","6","241","110","106240","96","1693802","129","1512735","0","0","0","0","4","159292","5","50684","239","3444087","180","511016","176","3169826","173","34262",,,"0","0","87","413481","50","638560","68","1319018","32","976669",,,,,"0","0"
"2015","A346","30004","AQUILEIA","UD","Friuli Venezia Giulia","6","2547","1269","1099516","1215","24644841","1065","17497292","34","1650008","11","301267","63","1404018","166","2249799","2486","47711021","2064","8583049","2027","45157625","1998","520973","1007","66213",,,"655","3343449","398","5040658","893","18136543","514","17463076","33","2121923","24","2117152","8","1689010"
"2015","A354","93002","ARBA","PN","Friuli Venezia Giulia","6","1022","464","399674","503","8931417","417","5648611","8","391890",,,"38","1055497","39","494977","1004","16467407","777","2622524","764","15278405","756","175693","643","72748",,,"329","1454532","141","1752451","343","6935942","188","6164253",,,"6","519921",,
"2015","A447","30005","ARTA TERME","UD","Friuli Venezia Giulia","6","1641","748","572438","859","16828439","649","9364505","20","756443","10","369540","47","836232","86","904180","1605","28770977","1302","4867493","1289","27236000","1274","312208","1268","161926","4","-84287","417","1890617","257","3195369","602","12161169","319","10397248","14","898886","12","1106198",,
"2015","A448","30006","ARTEGNA","UD","Friuli Venezia Giulia","6","2171","1152","887740","1136","24504062","846","13057634","28","1151729","10","281982","70","1564659","77","1160021","2133","41194556","1730","7415948","1709","39025808","1685","453024","1669","194302",,,"558","2587879","317","3988656","725","14769133","499","16886307","23","1442715","15","1288759","13","2261785"
"2015","A491","30007","ATTIMIS","UD","Friuli Venezia Giulia","6","1386","695","407497","669","12748432","594","8733472","20","470656","4","101539","55","934951","56","760838","1363","23590601","1072","3924155","1060","22110859","1047","252604","818","80779",,,"393","1844033","220","2723720","475","9610988","263","8684490","14","891354","7","597785",,
"2015","A516","93004","AVIANO","PN","Friuli Venezia Giulia","6","6717","3457","5113553","3387","68487227","2600","40891430","74","2497159","19","536832","180","3406736","372","4784753","6575","121702700","5414","21183307","5302","114582719","5228","1325263","3687","457831","13","-117384","1716","7961652","989","12430208","2347","47674731","1420","47490466","106","6721471","55","4970678","18","3228999"
"2015","A530","93005","AZZANO DECIMO","PN","Friuli Venezia Giulia","6","11024","6095","6770554","6104","132824874","3751","56957768","132","4920320","52","1733897","383","10292443","689","13954953","10781","218615935","8978","41078746","8815","207890848","8726","2429281","6561","959167","24","-208765","2527","11834210","1487","18606329","4143","84645179","2377","80987232","196","12406487","131","11764129","58","13443974"
"2015","A553","30008","BAGNARIA ARSA","UD","Friuli Venezia Giulia","6","2618","1353","1047752","1369","28703462","1047","16571912","29","847637","6","190889","72","1436099","127","2001266","2574","49451241","2120","8803961","2079","46532348","2047","539549","1551","173904","4","-28549","656","3183471","371","4646927","912","18615453","601","20535530","31","2010823","14","1266117","6","1573938"
"2015","A640","93006","BARCIS","PN","Friuli Venezia Giulia","6","229","109","105540","81","1558239","117","1621369",,,,,"10","140299","21","235736","225","3692463","181","616606","177","3461666","175","38632",,,"0","0","75","384470","40","514333","72","1439014","35","1114765",,,,,"0","0"
"2015","A700","30009","BASILIANO","UD","Friuli Venezia Giulia","6","3916","2125","1587389","2006","42060814","1514","23033837","38","1429960","12","818054","158","3290141","151","2147497","3817","71981510","3141","12359899","3083","67683235","3044","784022","3043","336066","12","-120564","972","4704204","575","7151670","1377","27801261","869","29167094","41","2664433","32","2969980","10","1555286"
"2015","A810","30010","BERTIOLO","UD","Friuli Venezia Giulia","6","1925","974","825425","897","17754593","798","10834971","18","676824","11","459919","81","1585834","129","1533425","1874","32607904","1487","5428883","1468","30218893","1446","343745","1439","171351",,,"535","2610410","320","4000551","701","14229186","322","10832789","18","1119756","11","1035199","6","974921"
"2015","A855","30011","BICINICCO","UD","Friuli Venezia Giulia","6","1439","731","582461","758","15320640","528","7159401","11","681442","14","276356","52","1137394","96","1739265","1403","25982672","1169","4598484","1154","24698354","1141","284272","914","89441","5","-11724","395","1765993","215","2691286","484","9824468","293","9854818","18","1124926","16","1454751","4","747609"
"2015","A983","30012","BORDANO","UD","Friuli Venezia Giulia","6","595","278","189980","319","6271766","238","2784395",,,,,"12","172779","5","97434","587","9388046","452","1489365","439","8756241","429","98861","421","9694",,,"188","717727","103","1297993","193","3895753","102","3320082",,,,,,
"2015","B215","93007","BRUGNERA","PN","Friuli Venezia Giulia","6","6504","3299","4111360","3683","73903975","2101","30180664","70","2205005","34","1298434","260","6654139","404","6352247","6340","119745104","5235","20764896","5155","113310365","5088","1319011","4274","661072","19","-383579","1608","7696392","803","10003061","2661","54570322","1176","39710373","99","6255555","57","5195565","25","4601224"
"2015","B247","93008","BUDOIA","PN","Friuli Venezia Giulia","6","1880","1032","1644412","954","20492985","686","10895566","38","1166255","12","320872","66","1600152","106","1431893","1842","36962322","1510","7121124","1474","35086030","1451","408934","46","4176","8","-32183","477","2239619","276","3389342","615","12535679","409","14123402","50","3216966","22","1982601","14","2427702"
"2015","B259","30013","BUJA","UD","Friuli Venezia Giulia","6","5034","2557","2522675","2461","53905273","2006","29577898","73","3109613","35","853654","194","4135103","267","3960009","4929","94429711","3965","17201127","3897","88907837","3862","1031684","3654","562275","11","-82921","1302","6066404","736","9226571","1751","35638317","1045","35508570","70","4389236","54","5005148","21","4170560"
"2015","B309","30014","BUTTRIO","UD","Friuli Venezia Giulia","6","3123","1608","1735838","1682","37928765","1174","20952564","57","2088847","15","555376","86","1723333","196","3412528","3045","66170032","2557","13160526","2524","63275786","2488","744884","2231","127719","6","-74181","736","3504012","381","4782234","1003","20354550","821","28274498","71","4529428","58","5262024","17","2791590"
"2015","B483","30015","CAMINO AL TAGLIAMENTO","UD","Friuli Venezia Giulia","6","1226","645","572033","562","11323839","512","7190519","10","507024","6","124028","65","1567104","82","1269796","1207","21649450","946","3809589","931","20251869","922","233452","922","81248",,,"352","1621110","181","2228421","420","8382755","229","7767668","15","977569","16","1514860",,
"2015","B536","30016","CAMPOFORMIDO","UD","Friuli Venezia Giulia","6","5739","3260","4125136","2985","73918305","2175","41860210","138","7397336","30","887594","202","4583889","300","4999463","5588","133497618","4813","28462002","4730","128622435","4678","1518534","4669","1007232","17","-100748","1171","5612419","675","8444477","1866","38101571","1568","54641754","179","11439842","136","12502713","58","10768079"
"2015","B598","93009","CANEVA","PN","Friuli Venezia Giulia","6","4685","2513","3182019","2236","47788861","1881","26362268","54","1730528","16","385347","180","3804151","305","5134559","4562","85586212","3691","15193909","3645","80623360","3606","932382","2595","214520","17","-224806","1204","5751404","660","8210428","1718","34880595","917","30476933","75","4739502","35","3162879","20","4206642"
"2015","B712","31001","CAPRIVA DEL FRIULI","GO","Friuli Venezia Giulia","6","1331","685","672266","706","15736779","540","9668643","18","643137","5","352285","43","1003336","64","974074","1312","28756829","1105","5822420","1086","27550470","1072","323701","1022","157733",,,"297","1459172","162","2048090","493","10055426","320","10737751","26","1695365","18","1661526","7","2385181"
"2015","B788","30018","CARLINO","UD","Friuli Venezia Giulia","6","2042","1078","792412","1010","21060436","796","11599772","13","386900","5","244761","87","1935535","158","3001198","2002","37869057","1635","6748397","1609","35701897","1589","411276","1570","140907","6","-53519","526","2784171","308","3878770","743","15075093","402","13609232","21","1379886","15","1411311","10","2102742"
"2015","B940","93010","CASARSA DELLA DELIZIA","PN","Friuli Venezia Giulia","6","6091","3012","2972522","3362","70740069","2160","38204831","62","2401562","20","717548","183","4131637","269","4402468","5959","119474074","4977","21596096","4871","113327686","4808","1327681","4073","445086","15","-106931","1407","6451422","809","10148371","2195","45342504","1446","48835386","106","6740794","48","4303197","22","4068650"
"2015","B994","30019","CASSACCO","UD","Friuli Venezia Giulia","6","2245","1159","1144384","1078","22061801","938","13955471","30","1376277","16","271754","74","1807707","107","1985866","2192","41178928","1725","7328790","1695","38758799","1683","449257","1673","192339","7","-52036","590","2636489","321","4041457","795","16003367","435","14856172","35","2230042","24","2230295","10","1567992"
"2015","C217","93011","CASTELNOVO DEL FRIULI","PN","Friuli Venezia Giulia","6","701","338","318024","322","6019975","309","4183283","4","156917",,,"19","442874","27","254571","681","11104704","537","1762143","527","10349213","518","117042","8","548",,,"216","979393","110","1351072","240","4838244","113","3714397","4","235447","5","453167","0","0"
"2015","C327","30020","CASTIONS DI STRADA","UD","Friuli Venezia Giulia","6","2843","1453","1137926","1425","26700496","1114","15592347","35","987081","21","981718","112","2647684","158","2723509","2779","48852637","2224","8093058","2191","45887560","2159","528261","2147","182310","5","-43681","792","3708190","398","5009159","1056","21457197","518","17433031","27","1699965","19","1657803","6","852575"
"2015","C385","93012","CAVASSO NUOVO","PN","Friuli Venezia Giulia","6","1206","556","597433","582","11787547","540","7073153","8","173948","4","45124","22","487058","43","587700","1191","20194033","934","3266334","923","18886001","910","217474","784","51028",,,"347","1585687","162","2034012","447","8960534","225","7440943","10","615959","7","614241","0","0"
"2015","C389","30021","CAVAZZO CARNICO","UD","Friuli Venezia Giulia","6","822","418","408512","417","9077679","361","5829181","9","293960","11","266147","8","128391","25","357453","813","15975185","662","2888975","651","15157920","646","178868","17","1997","0","0","201","911983","91","1156492","301","6080416","207","6904558","10","650308","8","792179",,
"2015","C494","30022","CERCIVENTO","UD","Friuli Venezia Giulia","6","531","226","68631","260","4693917","234","3314149","6","256754",,,"15","232504","21","399307","521","8960931","410","1423427","408","8297559","399","93909","8","785",,,"145","728978","91","1134819","189","3817394","97","3125245",,,"0","0",,
"2015","C556","30023","CERVIGNANO DEL FRIULI","UD","Friuli Venezia Giulia","6","9967","4848","5202794","5629","118379655","3504","62996599","148","6144106","30","1089936","258","5341350","379","4701636","9712","198431815","8094","37330727","7930","188556575","7796","2200456","5853","658194","26","-261347","2417","11651270","1344","16906119","3330","68065935","2404","82178819","198","12543512","126","11353709","29","4920647"
"2015","C640","93013","CHIONS","PN","Friuli Venezia Giulia","6","3683","1805","1913218","2125","45091324","1222","17134794","33","1305421","14","441270","123","2035734","176","3124113","3602","68983978","2985","12283414","2939","65490057","2907","756993","2116","58758","10","-345898","873","4183427","560","6955646","1400","28576533","698","23189813","63","4018711","30","2682454","19","3268655"
"2015","C641","30024","CHIOPRIS VISCONE","UD","Friuli Venezia Giulia","6","538","235","177506","304","4773153","186","2742294",,,,,"19","407401","25","234985","527","8199524","435","1313775","420","7663769","415","87924","410","41437",,,"192","721820","69","851886","183","3650702","80","2718881","9","561432",,,"0","0"
"2015","C656","30025","CHIUSAFORTE","UD","Friuli Venezia Giulia","6","519","242","124261","232","4204758","233","3546979",,,"4","94693","25","327645","25","315846","505","8494946","394","1417853","390","7929455","381","89079","4","1043",,,"161","803671","94","1161561","151","3016034","102","3352283",,,"4","368456","0","0"
"2015","C699","93014","CIMOLAIS","PN","Friuli Venezia Giulia","6","354","181","239790","165","2925846","156","2012458","6","361418",,,"16","290247","11","9008","350","5666380","279","950998","275","5376086","268","61396","5","556","0","0","109","464476","44","548984","145","2946837","52","1700342",,,"0","0",,
"2015","C758","30026","CIVIDALE DEL FRIULI","UD","Friuli Venezia Giulia","6","8689","4220","5337209","4296","92024564","3506","60932532","155","6306874","39","1269740","224","4293315","528","9361056","8498","174957076","6947","33983744","6819","166362305","6705","1949752","6688","985335","26","-214241","2170","9847597","1161","14487967","2884","58802499","1997","68065311","197","12824305","130","11773214","51","8712300"
"2015","C790","93015","CLAUT","PN","Friuli Venezia Giulia","6","753","349","315537","341","5894638","329","4162076","8","265213",,,"35","691459","44","778858","740","11662458","566","1796444","553","10795111","542","121424","7","825",,,"235","1016546","127","1617072","257","5221567","115","3766112","6","369966","4","364127","0","0"
"2015","C791","93016","CLAUZETTO","PN","Friuli Venezia Giulia","6","340","156","107132","124","2287693","184","2415058",,,,,"7","182790","12","150797","327","5068891","247","817992","244","4741896","243","54418","11","1357",,,"111","441644","54","663327","115","2302010","49","1661788",,,,,"0","0"
"2015","C817","30027","CODROIPO","UD","Friuli Venezia Giulia","6","11955","6309","6850689","6144","133948504","4579","74819567","188","7972055","46","1223758","385","9526849","629","11859955","11638","238251468","9615","45063611","9429","226381903","9296","2645252","7553","1423526","33","-210429","2838","13231738","1671","21061661","4133","84404352","2678","91739886","251","15772766","164","14608570","58","12156345"
"2015","C885","30028","COLLOREDO DI MONTE ALBANO","UD","Friuli Venezia Giulia","6","1726","898","877120","783","17554380","725","10290476","34","2036816","11","242054","60","1329792","111","2306933","1674","33406724","1336","6423841","1318","31515697","1297","365392","1293","110949",,,"472","2260087","257","3194122","566","11345716","348","11762763","28","1811442","23","2222700","16","2994161"
"2015","C918","30029","COMEGLIANS","UD","Friuli Venezia Giulia","6","407","170","91790","159","3086698","225","3256950",,,"5","65394","13","185713","22","174441","398","6754493","322","1079676","318","6347224","312","72251","5","290","0","0","114","576751","66","833627","138","2724159","80","2620798",,,,,"0","0"
"2015","C991","93017","CORDENONS","PN","Friuli Venezia Giulia","6","13623","7441","8709897","7186","164059935","5159","92766999","252","10207855","47","2274314","436","9493915","726","13081009","13315","290343370","11371","57357265","11180","278912671","11053","3283342","9688","1723765","30","-281269","2762","13046863","1661","21002533","5044","103225573","3394","115914337","313","19791364","217","19813094","81","16153109"
"2015","C993","93018","CORDOVADO","PN","Friuli Venezia Giulia","6","2057","1042","815457","1108","24506326","739","10870022","22","897163","10","360951","77","1913362","119","2138691","2025","40295263","1651","7501271","1614","38098102","1593","443367","1576","116248",,,"511","2522208","300","3749942","689","14021439","466","15841253","40","2567647","25","2361271","7","1336695"
"2015","D014","31002","CORMONS","GO","Friuli Venezia Giulia","6","5873","2649","2649756","2806","56392830","2528","41266044","94","3318058","26","1164448","171","3933170","311","5621427","5769","110739085","4653","20679382","4572","104594602","4499","1214591","3469","544257","7","-54426","1622","7757925","882","11004983","1908","38756623","1224","41802773","97","6207641","75","6679182","27","4336998"
"2015","D027","30030","CORNO DI ROSAZZO","UD","Friuli Venezia Giulia","6","2417","1223","1239094","1259","24954626","900","14223952","23","588231","15","979924","76","1584994","226","3678189","2361","45394994","1923","8393925","1892","42832058","1873","496210","1854","211983","4","-4187","626","2881049","350","4411026","884","17706175","454","15384125","43","2843565","31","2836039","10","1986427"
"2015","D085","30031","COSEANO","UD","Friuli Venezia Giulia","6","1704","850","637980","842","18408342","698","9685440","14","311511","9","140189","67","1317698","71","1235854","1651","31049678","1367","5543162","1346","29393153","1326","336731","1322","134632",,,"455","2234659","270","3345296","577","11682962","334","11193452","22","1332427","16","1441894","9","1520939"
"2015","D300","30032","DIGNANO","UD","Friuli Venezia Giulia","6","1801","920","780917","809","17221089","799","11108176","15","544963","19","984078","62","1273859","115","2193437","1774","32953561","1447","5886481","1420","31051639","1403","356588","1345","149398",,,"460","2233310","304","3835434","638","12898037","341","11498706","18","1152969","13","1198981","11","1998853"
"2015","D312","31003","DOBERDO' DEL LAGO","GO","Friuli Venezia Giulia","6","1046","567","538678","507","11110634","436","7600355","19","1014165",,,"24","470538","41","1029930","1028","21195151","847","4063947","834","20206042","823","237704","690","150000",,,"263","1202740","119","1511727","345","7105728","269","9139276","22","1398424","17","1591703",,
"2015","D316","30033","DOGNA","UD","Friuli Venezia Giulia","6","151","64","20027","55","1076482","81","1144250","0","0","0","0","8","125892","8","43154","148","2359478","106","381862","106","2183768","104","25017","103","13016","0","0","53","224256","21","258794","47","948803","27","883799",,,"0","0","0","0"
"2015","D321","31004","DOLEGNA DEL COLLIO","GO","Friuli Venezia Giulia","6","331","114","89083","158","2534171","122","1646673",,,"4","111339","8","199076","36","252396","320","4701421","220","811410","217","4362051","215","49234","10","1132","0","0","139","514266","55","681252","85","1651746","41","1387084","4","226386","5","454310",,
"2015","D324","32004","SAN DORLIGO DELLA VALLE","TS","Friuli Venezia Giulia","6","4639","2262","2836496","2308","52956209","1950","33361107","53","2175096","25","849202","142","2688842","179","3250498","4547","95643769","3922","18328144","3857","91551262","3803","1072115","2924","497265","6","-30684","954","4990853","606","7576871","1711","35157255","1179","39939682","65","4103595","54","4970871","20","3413519"
"2015","D366","30034","DRENCHIA","UD","Friuli Venezia Giulia","6","111","42","7933","36","658904","66","622287",,,"0","0",,,"0","0","110","1347283","73","171941","70","1138228","67","12186","8","558","0","0","53","269127","23","285084","26","531277","9","287861","0","0","0","0","0","0"
"2015","D383","32001","DUINO-AURISINA","TS","Friuli Venezia Giulia","6","6592","3457","5733645","3048","77508436","2859","56745389","145","6490977","33","1264263","202","4633178","272","5178011","6411","152757917","5479","33151011","5365","147152202","5282","1740581","232","49266","14","-126410","1423","6694551","773","9690060","2062","42267017","1802","62595932","227","14471548","161","14850964","60","10970320"
"2015","D408","30035","ENEMONZO","UD","Friuli Venezia Giulia","6","1019","479","300399","486","9826431","411","5967962","12","429020","5","231573","34","503704","61","735297","984","17377205","783","2953955","766","16432402","753","190223","24","1785",,,"311","1410957","123","1535260","368","7598734","185","6047277","13","808015",,,,