"anno_di_imposta","codice_catastale","codice_istat_comune","denominazione_comune","sigla_provincia","regione","codice_istat_regione","numero_contribuenti","reddito_da_fabbricati","reddito_da_fabbricati_1","reddito_da_lavoro_dipendente","reddito_da_lavoro_dipendente_1","reddito_da_pensione_frequenza","reddito_da_pensione_ammontare","reddito_da_lavoro_autonomo","reddito_da_lavoro_autonomo_1","reddito_di_spettanza_dell","reddito_di_spettanza_dell_1","reddito_di_spettanza_dell_2","reddito_di_spettanza_dell_3","reddito_da_partecipazione","reddito_da_partecipazione_1","reddito_imponibile_frequenza","reddito_imponibile_ammontare","imposta_netta_frequenza","imposta_netta_ammontare_in","bonus_spettante_frequenza","bonus_spettante_ammontare","reddito_imponibile_addizionale","reddito_imponibile_addizionale_1","addizionale_regionale_dovuta","addizionale_regionale_dovuta_1","addizionale_comunale_dovuta","addizionale_comunale_dovuta_1","reddito_complessivo_minore","reddito_complessivo_minore_1","reddito_complessivo_da_0","reddito_complessivo_da_0_1","reddito_complessivo_da_10000","reddito_complessivo_da_10000_1","reddito_complessivo_da_15000","reddito_complessivo_da_15000_1","reddito_complessivo_da_26000","reddito_complessivo_da_26000_1","reddito_complessivo_da_55000","reddito_complessivo_da_55000_1","reddito_complessivo_da_75000","reddito_complessivo_da_75000_1","reddito_complessivo_oltre","reddito_complessivo_oltre_1"
"2016","A103","30001","AIELLO DEL FRIULI","UD","Friuli Venezia Giulia","6","1753","903","695714","785","17556647","796","12007233","24","1011971","9","354171","48","1006457","76","1671998","1709","32923598","1390","6039584","454","371832","1352","31049972","1316","356912","774","51066",,,"457","2228971","292","3623855","564","11424552","345","11808132","39","2468287","23","2099194","8","1355367"
"2016","A254","30002","AMARO","UD","Friuli Venezia Giulia","6","631","337","183627","371","7493238","218","3656008","6","146913",,,"16","337559","21","320710","617","11840644","505","2004916","211","180466","499","11220531","487","130945","14","2087","4","-11045","150","711344","75","935908","239","4992511","146","4811010","5","314882","4","350130",,
"2016","A267","30003","AMPEZZO","UD","Friuli Venezia Giulia","6","773","320","213037","335","5958807","378","5247479","4","199404","7","121926","27","547660","46","757318","756","12528912","581","1999799","203","165659","572","11552192","556","131486","560","46141","0","0","229","1100635","134","1677500","264","5239066","127","4340137","5","315995","6","561281","0","0"
"2016","A283","93001","ANDREIS","PN","Friuli Venezia Giulia","6","225","106","103039","91","1726237","123","1454877","0","0","0","0","4","131376",,,"225","3387878","170","502087","56","45996","169","3068560","167","33756","6","609","0","0","79","403444","44","556303","66","1315745","33","1023377",,,,,"0","0"
"2016","A346","30004","AQUILEIA","UD","Friuli Venezia Giulia","6","2552","1293","1104518","1239","25751084","1061","17182697","32","1608061","11","322033","58","1351933","158","2427476","2491","48595324","2061","8789913","720","581763","2029","45836628","1990","529744","996","72861",,,"642","3353138","418","5315948","866","17519244","524","17636775","41","2622120","23","2009831","10","2411759"
"2016","A354","93002","ARBA","PN","Friuli Venezia Giulia","6","1012","469","388445","493","9025353","410","5644916","7","447686",,,"38","1046964","41","479989","990","16562073","765","2686946","280","224553","747","15220178","732","174654","641","72300","4","-24467","309","1319592","155","1927777","339","6853588","183","6061542","4","257369","6","549431",,
"2016","A447","30005","ARTA TERME","UD","Friuli Venezia Giulia","6","1615","747","557736","858","16650348","630","9377876","15","560093","10","277223","40","853360","83","856418","1574","28314364","1280","4711521","528","429809","1266","26786465","1248","306193","1245","158971","6","-28269","411","1937190","268","3360456","578","11784258","306","10066966","15","935627","15","1350154",,
"2016","A448","30006","ARTEGNA","UD","Friuli Venezia Giulia","6","2159","1166","878545","1121","24687417","837","13452260","27","1098950","11","321402","59","1362644","72","1450445","2103","41835419","1714","7577493","621","520282","1692","39674077","1666","464935","1653","197297","6","-24081","519","2274349","303","3799134","741","15063233","513","17414448","23","1489070","17","1480882","14","2421779"
"2016","A491","30007","ATTIMIS","UD","Friuli Venezia Giulia","6","1356","683","394877","667","12843366","587","8642913","13","350350","4","81162","48","738294","53","563576","1323","22963566","1052","3753210","404","325973","1043","21418720","1025","243945","803","77166",,,"368","1792499","231","2872589","476","9682168","237","7775919","21","1346840","6","514068",,
"2016","A516","93004","AVIANO","PN","Friuli Venezia Giulia","6","6679","3494","4907541","3408","69801810","2572","41555006","64","2394980","20","725960","166","3437040","353","4984860","6499","123369125","5324","21680456","1989","1645455","5231","116053425","5170","1346992","3737","471143","14","-111450","1630","7582799","995","12480216","2339","47792072","1427","48045095","113","7068533","71","6222658","18","3689938"
"2016","A530","93005","AZZANO DECIMO","PN","Friuli Venezia Giulia","6","11010","6071","6543358","6156","135539183","3727","58102096","107","4417149","45","1710528","378","10404288","663","16228446","10738","222616473","9019","42056968","3732","3118817","8852","212196023","8768","2485819","6662","987655","22","-291169","2416","11270346","1444","18053557","4210","85978715","2396","81558469","231","14610670","135","12294551","63","14487855"
"2016","A553","30008","BAGNARIA ARSA","UD","Friuli Venezia Giulia","6","2601","1362","1014418","1376","28449606","1036","16578008","26","892748","5","144665","55","1293969","116","1883803","2542","48892616","2084","8553295","737","588541","2039","45883137","2014","534443","1492","171006","8","-68675","637","3019675","356","4452356","922","18907564","595","20027358","37","2391390","15","1327659","7","1239148"
"2016","A640","93006","BARCIS","PN","Friuli Venezia Giulia","6","224","111","104961","83","1576426","113","1599592",,,,,"10","97407","22","249450","218","3615802","167","606392","54","44961","166","3323466","161","36934","4","385","0","0","66","316266","42","534830","80","1608134","29","899972",,,,,"0","0"
"2016","A700","30009","BASILIANO","UD","Friuli Venezia Giulia","6","3928","2119","1484219","2011","41992529","1515","23366500","35","1339777","9","778734","141","2917813","152","2206569","3807","71588586","3108","12197086","1146","947000","3041","67165980","3003","778527","2994","333281","7","-15884","997","4774926","545","6770917","1387","28144301","862","28882163","46","2880071","28","2667786","12","1846734"
"2016","A810","30010","BERTIOLO","UD","Friuli Venezia Giulia","6","1903","986","830294","895","17440797","794","11041395","15","706938","8","431679","70","1440053","123","1629955","1843","32443965","1453","5392482","553","465709","1436","30188723","1423","346013","1415","172003",,,"530","2571301","296","3688339","703","14288490","315","10509066","22","1357704","16","1529581","6","878405"
"2016","A855","30011","BICINICCO","UD","Friuli Venezia Giulia","6","1440","739","602204","762","15538341","524","7330124","14","909260","11","275039","49","995637","89","1776414","1398","26464324","1148","4768681","434","333780","1130","24979429","1116","288888","896","92210",,,"402","1827568","208","2617465","474","9586015","302","10112638","20","1277260","15","1417464","6","1212809"
"2016","A983","30012","BORDANO","UD","Friuli Venezia Giulia","6","577","282","179710","301","5826731","236","2864531",,,,,"13","146491","4","90633","569","8996255","423","1355062","173","142921","409","8205360","404","93175","391","9154",,,"184","819713","98","1240018","183","3729045","101","3226208",,,,,"0","0"
"2016","B215","93007","BRUGNERA","PN","Friuli Venezia Giulia","6","6555","3316","4022108","3761","76652516","2096","30627095","56","1951582","30","2202735","240","6209643","393","7541812","6390","126232753","5281","22730753","2453","2060773","5189","119427767","5153","1397688","4382","705962","13","-106173","1555","7564361","776","9738665","2697","55434785","1240","41515270","116","7414645","61","5539091","25","7831920"
"2016","B247","93008","BUDOIA","PN","Friuli Venezia Giulia","6","1912","1048","1657267","986","21557118","683","11107753","34","1252642","11","279622","62","1364126","109","1401670","1865","37892614","1554","7297028","568","460902","1523","36181410","1506","422654","83","9175","4","-2873","481","2275576","263","3277081","636","13027426","428","14940609","45","2878767","24","2156044","14","2363319"
"2016","B259","30013","BUJA","UD","Friuli Venezia Giulia","6","5016","2554","2421624","2486","55083880","1972","29674156","65","3130225","31","889601","179","4081402","263","4329254","4880","96213828","3929","17700005","1412","1168234","3877","90654069","3829","1056549","3635","572971","11","-109273","1275","6022029","713","9006230","1732","35421516","1081","36770998","74","4711325","49","4582292","25","5462221"
"2016","B309","30014","BUTTRIO","UD","Friuli Venezia Giulia","6","3096","1596","1666033","1650","37190210","1165","21397780","49","1743491","11","603280","79","1483513","201","3709251","3008","65867455","2487","13021766","837","686152","2448","62480676","2410","737382","1434","103074","5","-18565","717","3421703","381","4817496","1006","20508545","806","27758634","64","4047185","51","4686255","26","4192973"
"2016","B483","30015","CAMINO AL TAGLIAMENTO","UD","Friuli Venezia Giulia","6","1219","644","542945","565","11036874","500","7281536","9","541810","5","104558","62","1642243","83","1288254","1185","21471171","943","3731724","339","275508","931","20158916","922","232714","919","81155",,,"336","1536738","182","2265173","425","8620900","228","7747729","10","670889","21","1920109",,
"2016","B536","30016","CAMPOFORMIDO","UD","Friuli Venezia Giulia","6","5818","3262","4025176","3072","73792365","2155","42258909","128","7579556","30","945072","183","4622396","305","5429193","5647","134194707","4771","28519126","1517","1258156","4663","128900285","4607","1532042","4595","1004576","11","-117686","1267","5707525","652","8195894","1872","38368064","1551","53726528","207","13206123","129","11899158","61","11609624"
"2016","B598","93009","CANEVA","PN","Friuli Venezia Giulia","6","4699","2507","3115400","2275","48565688","1868","26747511","49","1817796","16","461318","171","3696253","297","5925471","4579","87290099","3692","15612312","1309","1086562","3634","82022396","3589","951516","2627","218868","8","-93747","1199","5685881","661","8251036","1701","34615158","945","31603488","74","4740991","43","4089565","21","4409280"
"2016","B712","31001","CAPRIVA DEL FRIULI","GO","Friuli Venezia Giulia","6","1318","693","655076","687","15987969","537","9852742","15","587601","5","510026","39","803847","59","815899","1292","29169175","1086","5990464","363","310835","1067","28003979","1056","330237","1013","163700","5","-91479","273","1287427","163","2056471","485","9918452","330","11001010","25","1573564","17","1543016","8","3110213"
"2016","B788","30018","CARLINO","UD","Friuli Venezia Giulia","6","2034","1097","809015","1006","21468080","790","11781035","11","489611","4","273304","81","1930096","162","3232100","1987","38757173","1641","7017829","603","493377","1618","36690151","1598","423102","1575","144596",,,"490","2538654","325","4109259","749","15259734","395","13270687","25","1586754","19","1680150","14","2839175"
"2016","B940","93010","CASARSA DELLA DELIZIA","PN","Friuli Venezia Giulia","6","6101","2997","2824277","3414","70286513","2131","38869014","55","2250710","20","646021","164","3879556","272","4891968","5973","119508102","4932","21394679","2020","1657424","4851","113134506","4803","1328855","4093","443597","6","-29645","1412","6491925","792","9924175","2201","45432321","1450","48998716","110","7006278","54","4703206","22","3691999"
"2016","B994","30019","CASSACCO","UD","Friuli Venezia Giulia","6","2264","1163","1179441","1092","22632838","933","14128016","26","1436850","15","388791","74","1731772","108","2212994","2208","42080568","1726","7570295","649","537505","1707","39437191","1687","457322","1678","195252","6","-88217","587","2649307","348","4395528","786","15946514","428","14679253","40","2536749","26","2516792","8","1862452"
"2016","C217","93011","CASTELNOVO DEL FRIULI","PN","Friuli Venezia Giulia","6","676","338","317824","307","5901601","301","4192130",,,,,"23","461645","23","283070","661","11020785","503","1756089","192","160702","492","10146155","485","115528","9","563","4","-61874","195","919593","119","1479538","228","4655711","114","3765501","5","289621","4","387659","0","0"
"2016","C327","30020","CASTIONS DI STRADA","UD","Friuli Venezia Giulia","6","2860","1471","1133520","1447","26896743","1104","15858259","33","1081381","24","1097145","103","2579842","165","3192239","2790","49741014","2217","8382206","859","694963","2179","46717160","2152","540372","2133","185711","10","-111873","814","3713438","383","4816115","1048","21456415","511","17124914","41","2566296","26","2319434","5","991134"
"2016","C385","93012","CAVASSO NUOVO","PN","Friuli Venezia Giulia","6","1189","560","582581","590","12301170","519","7028531","6","125302",,,"22","411596","41","643118","1178","20634995","940","3375397","340","279718","923","19357487","908","222871","793","52970",,,"321","1502943","168","2118099","435","8762072","239","7878122","11","668377","8","729489","0","0"
"2016","C389","30021","CAVAZZO CARNICO","UD","Friuli Venezia Giulia","6","818","417","411737","418","8955446","352","5827670","9","221692","9","300312","9","227335","26","337312","807","15820918","665","2834736","230","192538","649","15096586","644","177516","28","3521",,,"193","805946","90","1140141","307","6200578","203","6757681","11","691151","8","827496",,
"2016","C494","30022","CERCIVENTO","UD","Friuli Venezia Giulia","6","539","229","73455","264","4674992","234","3335771","5","243906",,,"14","236909","21","417033","529","9135946","412","1482222","170","135118","405","8416696","396","96003","13","1211",,,"154","729728","93","1144055","184","3746371","100","3240909",,,"0","0",,
"2016","C556","30023","CERVIGNANO DEL FRIULI","UD","Friuli Venezia Giulia","6","10096","4876","4914648","5811","120225834","3471","63368907","122","6047204","28","1124316","240","5342332","393","5453794","9809","200792126","8166","37510755","3343","2671352","8026","190267767","7868","2221430","5960","668196","23","-168942","2413","11570543","1382","17361871","3351","68557807","2449","83262364","191","12159570","124","11173042","37","6401458"
"2016","C640","93013","CHIONS","PN","Friuli Venezia Giulia","6","3715","1818","1800655","2155","46146981","1240","17877906","28","1314491","12","378544","114","2175070","177","3623147","3641","71308834","3000","12854903","1360","1146381","2956","67660566","2931","787247","2190","64237",,,"864","4019130","523","6555760","1450","29746441","726","24259871","63","3997486","37","3359179","19","3451705"
"2016","C641","30024","CHIOPRIS VISCONE","UD","Friuli Venezia Giulia","6","512","233","176618","282","4696512","179","2771903","4","157432",,,"16","355614","23","242498","498","8161002","400","1297861","173","123033","391","7586819","388","87730","382","41126",,,"166","670713","66","826455","182","3640406","80","2601060","8","527417",,,"0","0"
"2016","C656","30025","CHIUSAFORTE","UD","Friuli Venezia Giulia","6","489","238","105903","217","4093822","220","3493252",,,,,"21","295174","24","292483","471","8329901","368","1444114","119","90704","362","7716799","358","87758","4","763",,,"144","743527","85","1044269","141","2839627","103","3455204",,,"4","397893","0","0"
"2016","C699","93014","CIMOLAIS","PN","Friuli Venezia Giulia","6","332","166","232291","156","2928066","147","1907122","6","377127",,,"16","319305","8","25843","328","5612472","268","952319","96","81891","264","5373689","257","60990","5","488","0","0","87","390427","53","681080","132","2731750","52","1699355",,,"0","0",,
"2016","C758","30026","CIVIDALE DEL FRIULI","UD","Friuli Venezia Giulia","6","8657","4228","5221804","4306","91470957","3494","61865579","136","5844485","39","1232758","210","4301249","514","9569582","8432","174424712","6868","33439782","2320","1912527","6740","165222248","6660","1939543","6613","973516","14","-57775","2116","9614124","1135","14181675","2888","58806569","2040","69657402","174","11262906","137","12294274","52","8778839"
"2016","C790","93015","CLAUT","PN","Friuli Venezia Giulia","6","751","345","308536","341","5817764","339","4244359","7","230427","0","0","35","638825","44","590146","739","11363371","555","1671447","209","168978","546","10464656","530","117981","7","849","0","0","240","1081209","119","1506429","260","5213706","122","4048844",,,,,"0","0"
"2016","C791","93016","CLAUZETTO","PN","Friuli Venezia Giulia","6","335","161","107588","128","2453838","176","2392475",,,,,"8","211385","15","138430","324","5228113","249","870923","77","66234","246","4908566","239","56206","13","1997","0","0","102","405704","53","659243","114","2240685","54","1778661",,,,,"0","0"
"2016","C817","30027","CODROIPO","UD","Friuli Venezia Giulia","6","12054","6383","6591339","6212","135120827","4550","76147318","161","8374235","44","1406101","370","9722068","620","12282837","11667","240518483","9559","45057373","3546","2932445","9396","227349668","9279","2667266","7581","1433157","34","-436535","2816","13165983","1577","19878230","4242","86386344","2735","93834723","266","16929081","158","14240896","59","11783135"
"2016","C885","30028","COLLOREDO DI MONTE ALBANO","UD","Friuli Venezia Giulia","6","1686","894","861395","764","17421931","707","10446405","28","1910612","10","276858","56","1514158","113","2679874","1637","33921681","1329","6506367","436","366476","1306","31953769","1296","371469","1285","113192",,,"404","1981133","268","3343504","568","11396762","354","12083710","31","2028816","25","2360568","14","3055276"
"2016","C918","30029","COMEGLIANS","UD","Friuli Venezia Giulia","6","403","170","95751","158","3081261","219","3242620","4","128835","5","88886","12","175920","20","170202","389","6736427","308","1067973","91","77885","303","6246079","299","71683","10","1683","0","0","107","526371","70","878665","130","2591481","83","2693924","4","248094",,,"0","0"
"2016","C991","93017","CORDENONS","PN","Friuli Venezia Giulia","6","13609","7446","8646136","7217","164315260","5098","93830587","223","10116824","50","2193534","396","9306565","690","12116138","13254","289536390","11250","56878462","3954","3253922","11047","277305390","10938","3274682","9610","1721045","22","-357884","2790","12934370","1575","19891237","5026","103220949","3408","116168042","323","20502065","223","20362373","84","15960598"
"2016","C993","93018","CORDOVADO","PN","Friuli Venezia Giulia","6","2059","1056","839835","1109","24514097","736","11159190","24","867379","10","462301","71","1665816","120","2340944","2015","41050403","1655","7695889","647","539895","1622","38903226","1604","453626","1591","121512",,,"490","2442748","299","3748344","712","14606720","452","15470152","41","2635638","30","2791301","8","1649345"
"2016","D014","31002","CORMONS","GO","Friuli Venezia Giulia","6","5815","2658","2592587","2793","56179262","2502","41751744","83","3090411","24","951849","162","3539507","301","6462971","5698","111034117","4575","20740598","1562","1294325","4491","104592267","4418","1218392","3240","544229","6","-21943","1537","7112636","839","10419922","1964","39772681","1239","42542509","90","5900662","58","5247279","36","6038579"
"2016","D027","30030","CORNO DI ROSAZZO","UD","Friuli Venezia Giulia","6","2415","1237","1233597","1258","24961799","893","14678412","22","510097","15","784459","82","1781297","227","3889410","2351","46045487","1945","8458758","750","639585","1916","43674430","1906","507851","1888","217484","7","-36747","566","2575127","340","4267661","935","18694546","467","15754576","33","2128838","31","2746331","17","2746528"
"2016","D085","30031","COSEANO","UD","Friuli Venezia Giulia","6","1675","850","631987","819","18455696","694","10050337","11","276134","9","133933","62","1161899","75","1085754","1626","31201575","1330","5576159","479","401934","1311","29304821","1297","338350","1288","133890","0","0","413","2082595","264","3268986","606","12339953","330","11084107","17","1073264","15","1375824","9","1697213"
"2016","D300","30032","DIGNANO","UD","Friuli Venezia Giulia","6","1812","943","811433","851","18015835","768","11025763","13","459170","19","947170","58","1294355","105","2168519","1779","33532021","1431","5996893","495","406281","1407","31585605","1399","365192","1340","153673","5","-18577","457","2154917","285","3604177","653","13132024","351","11848771","21","1341863","12","1125871","13","2345211"
"2016","D312","31003","DOBERDO' DEL LAGO","GO","Friuli Venezia Giulia","6","1049","559","500627","496","10957419","439","7736199","16","968176",,,"22","384211","40","1074978","1021","21113292","837","4066683","238","193282","812","20094028","802","236735","682","149252",,,"253","1021474","120","1502971","343","7031683","276","9246384","17","1040044","17","1588663","5","802604"
"2016","D316","30033","DOGNA","UD","Friuli Venezia Giulia","6","144","55","19111","54","1094042","77","1108441","0","0","0","0","7","143872","8","60198","142","2392987","105","396384","32","25224","105","2239511","104","25777","103","12959","0","0","46","201383","18","227800","51","1004403","26","828954",,,"0","0","0","0"
"2016","D321","31004","DOLEGNA DEL COLLIO","GO","Friuli Venezia Giulia","6","326","113","80283","154","2505577","126","1687283",,,"5","96060","6","150246","32","231727","311","4655268","219","793031","70","57250","213","4300010","210","49031","12","1770","0","0","130","458641","53","653177","87","1707952","45","1498623","5","306643",,,"0","0"
"2016","D324","32004","SAN DORLIGO DELLA VALLE","TS","Friuli Venezia Giulia","6","4671","2231","2739912","2385","54232471","1913","33194443","48","2045288","22","926160","127","2575589","180","3337573","4569","96372219","3914","18204910","1269","1046602","3862","92197233","3829","1085572","2989","507604","10","-76925","955","4969499","546","6880596","1744","35879770","1227","41347349","74","4600182","55","5046041","14","2326194"
"2016","D366","30034","DRENCHIA","UD","Friuli Venezia Giulia","6","109","44","7655","35","608813","65","638732","0","0","0","0",,,,,"106","1306752","66","162122","21","18263","65","1110043","64","11998","5","345","0","0","47","227181","20","247491","31","602911","8","260764","0","0","0","0","0","0"
"2016","D383","32001","DUINO-AURISINA","TS","Friuli Venezia Giulia","6","6649","3518","5568911","3098","78158022","2867","57485134","132","6259959","31","1349587","179","4067322","258","5555697","6442","153290464","5469","32885621","1449","1166761","5343","147123246","5259","1744769","228","53259","14","-149569","1412","6477676","791","9844393","2093","43056776","1828","63577508","224","14364137","150","13780031","60","11619272"
"2016","D408","30035","ENEMONZO","UD","Friuli Venezia Giulia","6","1035","484","299451","512","10042580","407","6037037","10","346124",,,"32","489053","63","901799","1002","17677724","804","2929487","318","257193","791","16613924","780","192957","32","3380",,,"298","1369068","136","1686296","394","8155543","177","5874229","11","682212",,,,
"2016","D426","93019","ERTO E CASSO","PN","Friuli Venezia Giulia","6","307","138","141439","173","3114371","103","1268624","0","0",,,"19","195612","18","148747","300","5023160","232","826019","104","87791","229","4628720","225","52991","6","550",,,"88","385800","47","576600","119","2411543","46","1499409",,,"0","0",,