"anno_di_imposta","codice_catastale","codice_istat_comune","denominazione_comune","sigla_provincia","regione","codice_istat_regione","numero_contribuenti","reddito_da_fabbricati_frequenza","reddito_da_fabbricati_ammontare","reddito_da_lavoro_dipendente_e_assimilati_frequenza","reddito_da_lavoro_dipendente_e_assimilati_ammontare","reddito_da_pensione_frequenza","reddito_da_pensione_ammontare","reddito_da_lavoro_autonomo_comprensivo_dei_valori_nulli_frequenza","reddito_da_lavoro_autonomo_comprensivo_dei_valori_nulli_ammontare","reddito_di_spettanza_dell_imprenditore_in_contabilita_ordinaria_comprensivo_dei_valori_nulli_frequenza","reddito_di_spettanza_dell_imprenditore_in_contabilita_ordinaria_comprensivo_dei_valori_nulli_ammontare","reddito_di_spettanza_dell_imprenditore_in_contabilita_semplificata_comprensivo_dei_valori_nulli_frequenza","reddito_di_spettanza_dell_imprenditore_in_contabilita_semplificata_comprensivo_dei_valori_nulli_ammontare","reddito_da_partecipazione_comprensivo_dei_valori_nulli_frequenza","reddito_da_partecipazione_comprensivo_dei_valori_nulli_ammontare","reddito_imponibile_frequenza","reddito_imponibile_ammontare","imposta_netta_frequenza","imposta_netta_ammontare","reddito_imponibile_addizionale_frequenza","reddito_imponibile_addizionale_ammontare","addizionale_regionale_dovuta_frequenza","addizionale_regionale_dovuta_ammontare","addizionale_comunale_dovuta_frequenza","addizionale_comunale_dovuta_ammontare","reddito_complessivo_minore_o_uguale_a_zero_euro_frequenza","reddito_complessivo_minore_o_uguale_a_zero_euro_ammontare","reddito_complessivo_da_0_a_10000_euro_frequenza","reddito_complessivo_da_0_a_10000_euro_ammontare","reddito_complessivo_da_10000_a_15000_euro_frequenza","reddito_complessivo_da_10000_a_15000_euro_ammontare","reddito_complessivo_da_15000_a_26000_euro_frequenza","reddito_complessivo_da_15000_a_26000_euro_ammontare","reddito_complessivo_da_26000_a_55000_euro_frequenza","reddito_complessivo_da_26000_a_55000_euro_ammontare","reddito_complessivo_da_55000_a_75000_euro_frequenza","reddito_complessivo_da_55000_a_75000_euro_ammontare","reddito_complessivo_da_75000_a_120000_euro_frequenza","reddito_complessivo_da_75000_a_120000_euro_ammontare","reddito_complessivo_oltre_120000_euro_frequenza","reddito_complessivo_oltre_120000_euro_ammontare"
"2014","A103","30001","AIELLO DEL FRIULI","UD","Friuli Venezia Giulia","6","1727","870","686213","750","17055709","787","11948953","28","1105467","11","352652","60","1168429","90","1637936","1692","32814261","1372","6038462","1350","30800197","1350","355188","757","50784",,,"448","2463873","306","3840043","580","11744811","307","10644634","39","2514747","18","1618885","8","1728381"
"2014","A254","30002","AMARO","UD","Friuli Venezia Giulia","6","630","340","188596","353","7209576","230","3647948","10","187259","6","118213","12","289531","24","282498","623","11566865","505","1926332","499","10941529","498","128658","12","1416",,,"157","719855","68","846284","261","5378883","133","4361133",,,,,,
"2014","A267","30003","AMPEZZO","UD","Friuli Venezia Giulia","6","795","317","201882","340","6073761","367","5098561","5","216065","7","101168","30","594117","48","712823","769","12594853","605","2002708","600","11675104","600","132512","592","46312","4","-5684","250","1290819","132","1654552","270","5349194","116","3885100","7","415091","7","614164","0","0"
"2014","D316","30033","DOGNA","UD","Friuli Venezia Giulia","6","144","60","18963","48","1035408","80","1129134","0","0","0","0","8","213462","7","68123","141","2409347","102","408716","102","2245330","102","26029","0","0",,,"43","175315","18","232135","55","1126142","22","712865",,,,,"0","0"
"2014","H038","30084","PREONE","UD","Friuli Venezia Giulia","6","207","105","25518","95","1754068","107","1508752",,,,,"4","80197",,,"205","3391290","157","521494","156","3197003","156","37170",,,"0","0","56","232581","27","332777","90","1822308","30","970823",,,"0","0","0","0"
"2014","I464","30107","SAURIS","UD","Friuli Venezia Giulia","6","321","159","120723","152","2802683","133","1694942","4","47242",,,"13","163078","39","364543","312","5196840","236","838066","234","4777917","234","54584","230","23857",,,"106","543167","50","608321","107","2200191","52","1831475",,,,,"0","0"
"2014","A283","93001","ANDREIS","PN","Friuli Venezia Giulia","6","242","113","116741","93","1729565","130","1514240","0","0","0","0","4","181778","5","84781","240","3530799","178","524402","178","3216529","178","35706",,,"0","0","82","402513","50","629399","77","1508885","29","876674",,,"0","0",,
"2014","D487","93020","FANNA","PN","Friuli Venezia Giulia","6","1186","566","660280","574","11039820","498","8447519","11","470230",,,"31","604156","48","598662","1163","21308669","922","3815687","911","20000204","911","229820","27","2839",,,"333","1558380","195","2460944","429","8620930","197","6489206","11","686971","8","714077",,
"2014","A346","30004","AQUILEIA","UD","Friuli Venezia Giulia","6","2535","1260","1117202","1189","24028646","1074","17372354","34","1617324","10","270065","78","1566979","174","2259958","2473","47120725","2063","8397698","2031","44557326","2030","515516","953","63160","5","-34709","639","3418691","416","5263196","917","18649382","471","15938206","35","2176004","23","2107042","8","1690244"
"2014","A354","93002","ARBA","PN","Friuli Venezia Giulia","6","1025","462","431518","497","8590557","426","5654120","12","447282",,,"42","1093425","38","497950","1008","16192145","758","2533687","753","15024920","753","172264","636","70856",,,"335","1465273","150","1864699","365","7451949","156","5179612","4","255861","5","437363",,
"2014","A447","30005","ARTA TERME","UD","Friuli Venezia Giulia","6","1653","732","575350","857","16225704","653","9380891","22","654790","11","374914","47","806619","91","821559","1618","28068745","1295","4616375","1272","26374878","1272","302334","1249","156454","4","-22103","460","2094104","261","3281542","596","11927924","295","9701909","14","907075","11","1051695",,
"2014","A448","30006","ARTEGNA","UD","Friuli Venezia Giulia","6","2152","1137","917524","1107","23821070","852","13100446","34","1332397","14","253898","75","1569398","74","1242263","2114","40881628","1704","7325956","1682","38628632","1682","449861","1637","190994",,,"553","2589596","317","3971215","737","14972152","473","15868473","24","1532140","19","1755392","10","2030206"
"2014","A491","30007","ATTIMIS","UD","Friuli Venezia Giulia","6","1377","699","445239","658","12430455","602","8789981","20","464224","4","79286","55","858499","51","598705","1349","23099558","1077","3715749","1065","21723843","1065","247531","829","78404","7","-31824","371","1753318","234","2904311","498","10017632","237","7818586","16","1049514","5","412535",,
"2014","A516","93004","AVIANO","PN","Friuli Venezia Giulia","6","6776","3485","5667742","3370","67664694","2614","40531953","92","2679169","24","439289","187","3247488","382","4469297","6620","120812825","5414","20632460","5311","113424472","5308","1310461","3725","450420","28","-145355","1744","8466462","1052","13217016","2366","47913919","1374","45898506","93","5862283","52","4812080","15","2754163"
"2014","A530","93005","AZZANO DECIMO","PN","Friuli Venezia Giulia","6","10980","6091","7152352","6026","127553184","3719","55606825","148","5072510","57","1883157","406","9147991","704","14261510","10728","211666601","8932","38809775","8775","201044118","8769","2346246","4475","757494","27","-354979","2566","12329989","1491","18641652","4271","86672150","2194","74488182","183","11605306","125","11358717","46","10310940"
"2014","A553","30008","BAGNARIA ARSA","UD","Friuli Venezia Giulia","6","2634","1364","1063987","1367","28231168","1045","16309555","36","962823","8","172212","75","1351358","138","1919415","2576","48727217","2119","8462507","2089","45894434","2089","530532","1855","184872","7","-36017","647","3206825","409","5159887","942","19173842","561","18830269","27","1747087","17","1590922","4","1244452"
"2014","A640","93006","BARCIS","PN","Friuli Venezia Giulia","6","229","103","103518","86","1456379","123","1660587",,,,,"8","121718","20","141507","225","3526707","174","565117","173","3265472","173","36770",,,,,"76","358711","40","502683","77","1551913","32","1047407",,,,,"0","0"
"2014","A700","30009","BASILIANO","UD","Friuli Venezia Giulia","6","3976","2118","1733099","2044","41994900","1541","23040419","50","1697220","13","425893","163","3333993","165","2341928","3893","72077106","3159","12187128","3125","67434691","3125","780032","3085","335050","8","-123119","1006","5050776","591","7427041","1434","28881254","829","27640415","41","2619065","28","2603637","12","1782928"
"2014","A810","30010","BERTIOLO","UD","Friuli Venezia Giulia","6","1917","961","922993","902","17283264","789","10620071","21","819334","12","439781","89","1790518","131","1424095","1865","32009819","1507","5267479","1491","30083282","1489","342416","1473","171265",,,"532","2644715","331","4140253","689","13910288","320","10719757","19","1161059","8","736963","5","871254"
"2014","A855","30011","BICINICCO","UD","Friuli Venezia Giulia","6","1431","719","628411","747","14845151","514","6974793","9","605382","15","475587","49","951352","108","1668418","1393","25336949","1159","4385508","1141","24006713","1141","276560","1048","89624","7","-36868","400","1848432","212","2644881","489","9838997","279","9261037","20","1262769","10","930115","5","863837"
"2014","A983","30012","BORDANO","UD","Friuli Venezia Giulia","6","583","283","201593","311","6052781","228","2616282","5","59063",,,"16","169694","6","89995","578","9042813","437","1360338","432","8369101","432","94752","415","9018","0","0","191","876622","102","1282798","192","3872107","92","2942707",,,,,,
"2014","B215","93007","BRUGNERA","PN","Friuli Venezia Giulia","6","6522","3318","4295387","3676","72269812","2096","29591289","72","2182102","35","1098553","269","5989732","429","6089357","6352","117072840","5259","19704100","5173","110554920","5170","1286232","4284","638101","23","-269722","1622","7974205","813","10057019","2761","56131025","1095","36802635","77","4949911","53","4709603","24","4041316"
"2014","B247","93008","BUDOIA","PN","Friuli Venezia Giulia","6","1895","1048","1725370","952","19610986","684","10544016","38","1362612","11","322183","72","1500785","118","1631983","1852","35881315","1521","6731191","1487","34019117","1487","395209","46","4696","6","-39147","500","2298469","276","3421779","626","12539855","397","13695851","42","2689090","19","1654544","15","2321934"
"2014","B259","30013","BUJA","UD","Friuli Venezia Giulia","6","5098","2588","2649850","2461","53229385","2031","29540767","84","3345140","40","878970","205","3770770","284","3939252","4992","93790011","4024","16728971","3960","88333918","3956","1024191","3709","559565","16","-77781","1345","6447847","752","9474078","1787","36222033","1023","34456723","70","4431957","48","4395855","17","3634488"
"2014","B309","30014","BUTTRIO","UD","Friuli Venezia Giulia","6","3130","1592","1863990","1678","37594422","1163","20744474","57","2010234","13","308716","91","1662181","205","3364669","3057","65480108","2580","12872157","2533","62602789","2533","736480","2283","125489","10","-99301","729","3583191","397","5024168","1039","21065232","803","27576937","61","3897689","50","4608857","21","3042082"
"2014","B483","30015","CAMINO AL TAGLIAMENTO","UD","Friuli Venezia Giulia","6","1238","641","603576","548","10669544","512","7124472","13","535358","7","164942","72","1699757","94","1135608","1208","20933924","937","3535280","926","19376197","926","222554","920","77823","4","-66576","356","1690655","200","2470111","432","8551671","205","6800470","13","833478","17","1568540",,
"2014","G680","93030","PINZANO AL TAGLIAMENTO","PN","Friuli Venezia Giulia","6","1143","574","418721","537","10371498","496","6992668","14","272076","6","166942","41","901852","42","347032","1128","18931967","891","3017336","880","17689267","880","201084","845","86261",,,"318","1535303","195","2464111","426","8487575","180","5928386","7","433677","6","520570",,
"2014","B536","30016","CAMPOFORMIDO","UD","Friuli Venezia Giulia","6","5724","3278","4196887","2933","71841585","2156","41421783","156","7827922","37","1167801","226","4332771","315","4987163","5575","131414388","4757","27839349","4668","126422372","4664","1497857","4615","986867","16","-132339","1196","5764200","685","8608148","1902","38828961","1502","51909288","186","11915008","115","10499020","60","11549465"
"2014","B598","93009","CANEVA","PN","Friuli Venezia Giulia","6","4756","2523","3376470","2252","46476195","1898","25972424","56","1862995","20","468494","189","3617684","320","5037445","4637","84064875","3763","14488779","3703","79066370","3700","913404","2604","210730","19","-120048","1266","6216284","687","8525592","1811","36524334","831","28138829","57","3676381","33","3083481","19","3442110"
"2014","B712","31001","CAPRIVA DEL FRIULI","GO","Friuli Venezia Giulia","6","1341","692","665932","715","15319999","532","9316194","24","639635","7","577131","51","1127916","64","861667","1322","27799041","1110","5391942","1097","26577795","1097","313045","1045","156164","4","-287840","291","1445294","183","2301730","502","10295830","313","10473151","19","1214615","17","1529153","7","1733048"
"2014","B788","30018","CARLINO","UD","Friuli Venezia Giulia","6","2043","1072","847963","1000","20567183","796","11349645","12","503513","4","211811","101","1852941","161","2889526","1994","37141283","1608","6504476","1583","34727340","1583","399816","1532","136308","8","-19365","526","2797069","318","3998619","769","15504825","371","12332221","18","1150799","13","1184421","10","2430304"
"2014","B940","93010","CASARSA DELLA DELIZIA","PN","Friuli Venezia Giulia","6","6084","2997","3104126","3351","70103762","2126","37546438","67","2257237","24","711139","200","4115860","276","4579510","5954","118705046","4929","21497856","4846","112497262","4845","1321901","4038","442448","20","-140999","1442","6765605","786","9870560","2268","46664664","1358","46302013","95","6010962","50","4401837","24","4711567"
"2014","B994","30019","CASSACCO","UD","Friuli Venezia Giulia","6","2245","1136","1154604","1073","22216741","928","13523034","33","1484790","17","239976","86","1738362","121","1883332","2192","40696941","1729","7131187","1709","38211855","1707","442071","1687","188593",,,"590","2585317","354","4472416","801","16092791","407","13750149","38","2436058","24","2213152","6","1418144"
"2014","C217","93011","CASTELNOVO DEL FRIULI","PN","Friuli Venezia Giulia","6","700","347","357797","315","5807674","317","4274452","4","135251",,,"23","463978","26","203518","683","11005897","522","1715049","517","10195877","516","115572","7","582",,,"216","981773","124","1560713","237","4742592","105","3440287","6","359628","4","359050","0","0"
"2014","C327","30020","CASTIONS DI STRADA","UD","Friuli Venezia Giulia","6","2820","1446","1185562","1406","26065468","1102","15295488","36","917834","24","933736","118","2565425","157","2535717","2751","47675244","2202","7734479","2166","44654317","2163","514916","2125","178043","8","-22708","788","3759555","414","5177715","1054","21334175","486","16195939","23","1472564","20","1768805","5","712861"
"2014","C385","93012","CAVASSO NUOVO","PN","Friuli Venezia Giulia","6","1217","581","694262","573","11495061","548","7071392","9","203563","4","47867","26","524479","44","590493","1195","19951683","929","3177457","915","18595534","915","214238","778","50395",,,"354","1642716","186","2334242","450","9038126","203","6741913","9","589260","7","651667","0","0"
"2014","C389","30021","CAVAZZO CARNICO","UD","Friuli Venezia Giulia","6","825","414","433623","414","8771959","365","5689567","11","312986","10","246163","13","192750","32","309488","818","15620588","669","2785343","654","14830520","654","173644","13","1230","0","0","206","957931","107","1342062","308","6206790","182","6172516","7","456973","11","1089482","0","0"
"2014","C494","30022","CERCIVENTO","UD","Friuli Venezia Giulia","6","533","231","71433","258","4676142","242","3351938","8","267846",,,"16","293149","19","352622","526","8958818","424","1417446","417","8341610","417","95183","10","1331",,,"135","683252","96","1179533","210","4232069","82","2687092",,,,,,
"2014","C556","30023","CERVIGNANO DEL FRIULI","UD","Friuli Venezia Giulia","6","9970","4813","5622734","5580","115174460","3515","62169164","158","6385350","31","906686","270","5307081","420","4811449","9738","195293968","8027","36123565","7880","184937126","7880","2164925","5800","639050","32","-356054","2476","12093748","1365","17132511","3387","69118197","2303","78303317","181","11501239","117","10289384","34","5444283"
"2014","C640","93013","CHIONS","PN","Friuli Venezia Giulia","6","3654","1790","2060595","2084","43633489","1207","16816920","35","1302483","13","330886","129","2347901","190","3082946","3582","67329841","2936","11806670","2887","63553286","2886","737262","2054","53788","8","-101814","894","4265487","558","6954281","1417","28807235","645","21603645","55","3455217","35","3171625","15","2755276"
"2014","C641","30024","CHIOPRIS VISCONE","UD","Friuli Venezia Giulia","6","529","232","174793","296","4678716","186","2676244","5","200460",,,"19","280663","25","164461","515","7951905","424","1234443","417","7453716","417","85192","399","39255",,,"182","718593","73","918966","190","3810602","70","2285608","8","509359",,,"0","0"
"2014","C656","30025","CHIUSAFORTE","UD","Friuli Venezia Giulia","6","513","234","124386","230","4309342","241","3614316",,,"4","125681","25","366228","27","373481","507","8822347","405","1507573","396","8229996","395","93610","6","1011",,,"158","926448","91","1152910","147","2935316","104","3420141","6","394221",,,,
"2014","C699","93014","CIMOLAIS","PN","Friuli Venezia Giulia","6","357","188","293945","161","2888544","155","2028871","8","324999",,,"16","234678","11","101475","351","5662819","289","930139","285","5417105","285","61875","6","333",,,"102","471664","54","665085","145","2929061","47","1463231",,,,,,
"2014","C758","30026","CIVIDALE DEL FRIULI","UD","Friuli Venezia Giulia","6","8736","4244","5618829","4309","91929225","3506","59494839","163","6250231","44","1147733","245","4300075","563","9195973","8539","173353229","6974","33182643","6855","164642187","6853","1929322","6718","969976","25","-461305","2237","10436018","1160","14541946","2975","60434677","1905","64628767","185","11912814","134","12166301","49","8240808"
"2014","C790","93015","CLAUT","PN","Friuli Venezia Giulia","6","752","352","347850","338","5712748","327","4095230","7","241672",,,"39","704294","50","696221","736","11392502","554","1746160","548","10479473","548","117990","7","991",,,"242","1073637","131","1662405","260","5294830","100","3259463","7","464343",,,"0","0"
"2014","C791","93016","CLAUZETTO","PN","Friuli Venezia Giulia","6","340","156","121377","117","2253807","189","2386450",,,,,"9","151751","12","109912","330","4983924","244","799193","242","4617555","241","52953","10","1163",,,"117","513674","49","603252","119","2381213","42","1385205",,,,,"0","0"
"2014","F574","30061","MONTENARS","UD","Friuli Venezia Giulia","6","431","216","130715","210","3903609","200","2745698",,,,,"14","340283",,,"424","7067370","327","1186000","321","6663014","321","76380","10","1020",,,"135","547080","67","836706","144","2914681","74","2411181","5","314260",,,,
"2014","C817","30027","CODROIPO","UD","Friuli Venezia Giulia","6","12000","6248","7287134","6146","132814723","4586","74103176","212","8186569","48","1200424","428","9103271","671","11632660","11732","235541394","9622","44138535","9453","223243975","9451","2610682","7955","1204768","35","-669444","2925","13828923","1709","21598828","4243","86310510","2522","86830559","264","16562179","150","13310210","59","10949672"
"2014","C885","30028","COLLOREDO DI MONTE ALBANO","UD","Friuli Venezia Giulia","6","1741","899","958311","777","17354291","731","10145809","37","2174247","13","261890","70","1358983","111","2146636","1687","33057341","1335","6267995","1316","31028396","1315","360158","1291","108586","6","-18786","481","2301204","270","3334558","586","11739904","316","10656852","24","1541807","35","3286702","10","2227988"
"2014","C918","30029","COMEGLIANS","UD","Friuli Venezia Giulia","6","423","171","92296","173","3079672","224","3172162",,,"5","70884","13","214542","26","263109","416","6780589","327","1085730","323","6341914","323","71780","7","270",,,"135","667916","75","931879","126","2492147","78","2565397",,,,,"0","0"
"2014","C991","93017","CORDENONS","PN","Friuli Venezia Giulia","6","13643","7466","9216496","7162","161059245","5118","90993441","284","10687077","51","2130813","457","9161221","713","12084901","13352","285042899","11361","55630895","11154","273373950","11149","3222900","9611","1682706","27","-264371","2824","13389986","1700","21559029","5252","107015104","3153","107908697","292","18308951","207","18659575","79","15698828"
"2014","C993","93018","CORDOVADO","PN","Friuli Venezia Giulia","6","2086","1060","892758","1120","24146016","746","10772135","24","775986","9","334553","83","1932154","125","1958545","2044","39576696","1660","7265999","1635","37396714","1634","436183","1586","114196","5","-44425","560","2847943","287","3632867","730","14966700","413","13957504","38","2411160","23","2140713","10","1675896"
"2014","D014","31002","CORMONS","GO","Friuli Venezia Giulia","6","5894","2611","2754626","2793","56005946","2513","40561933","103","3490825","27","841361","186","3574490","318","5896395","5788","109765736","4635","20286981","4555","103489182","4552","1201879","3759","382532","10","-94515","1656","8071728","848","10604899","2005","40518802","1148","39249105","100","6414309","66","6115804","25","4106942"
"2014","D027","30030","CORNO DI ROSAZZO","UD","Friuli Venezia Giulia","6","2440","1237","1330867","1263","24644832","893","13897240","24","560998","15","823932","85","1604282","228","3392015","2384","44499805","1946","8106569","1915","42087216","1910","487576","1869","207858","9","-88540","652","2971433","347","4349204","901","17903421","429","14394703","51","3252610","23","2057859","12","2085582"
"2014","D085","30031","COSEANO","UD","Friuli Venezia Giulia","6","1708","861","644662","833","17910718","707","9652496","13","215100","11","128016","69","1254947","75","1318586","1659","30582259","1341","5336906","1323","28781823","1323","330829","1305","131830","4","-16126","451","2309435","268","3308870","606","12236423","321","10803820","13","787833","16","1397074","9","1438837"
"2014","D300","30032","DIGNANO","UD","Friuli Venezia Giulia","6","1812","924","806824","807","16967187","820","11206025","18","478566","20","837694","67","1533040","114","1572636","1788","32099687","1446","5543645","1425","30141281","1425","345418","1353","143723","6","-50366","477","2401758","301","3771975","673","13624488","304","10327663","19","1234981","16","1436664","6","1216144"
"2014","D312","31003","DOBERDO' DEL LAGO","GO","Friuli Venezia Giulia","6","1044","570","525731","488","10877420","437","7499897","17","885173",,,"26","505349","41","953980","1017","20776323","853","3912113","836","19877946","836","233505","694","146799","6","-4789","247","1154260","133","1674473","352","7168901","256","8734282","22","1394942","13","1149217",,
"2014","D321","31004","DOLEGNA DEL COLLIO","GO","Friuli Venezia Giulia","6","335","118","95445","153","2489238","122","1631872",,,"4","57653","11","194498","37","203089","317","4598777","227","759569","223","4251836","223","47324","11","1496",,,"134","542437","58","712334","86","1666670","45","1522438",,,,,"0","0"
"2014","D324","32004","SAN DORLIGO DELLA VALLE","TS","Friuli Venezia Giulia","6","4652","2259","2958366","2259","52078642","1990","33180477","58","2359515","26","863364","151","2953593","188","3371990","4568","95136477","3921","18070371","3864","91093824","3862","1070180","2938","492638","12","-150981","956","5095136","589","7378220","1782","36511872","1115","37284770","84","5198651","53","4955785","17","3121518"